1,LIN00037,"New Holland Pier and Railway Station","railway station ferry pier",14975484575127239_eeb33aa4.jpg,"New Holland Pier Station in 1981",,"Walter Dendy","13 February 1981","Ben Brooksbank","22 September 2016",Geograph,Public,Reviewed,"Nick Nelson","15 June 2017","YAHS Industrial History Section","Nick Nelson","22 January 2018",,Incomplete,,,http://www.geograph.org.uk/photo/5127239,,"2019-07-29 09:58:01","2022-10-04 16:00:32"
2,LIN00030,"Grimsby Hydraulic Tower","hydraulic accumulator dock tower",14979555462126039_6233d37a.jpg,"Grimsby Dock Tower",,"Steve Farrow","14 June 2009","Steve Farrow","24 October 2010",Geograph,Public,Reviewed,"Nick Nelson","20 June 2017","YAHS Industrial History Section","Nick Nelson","12 December 2017",,Incomplete,,,http://www.geograph.org.uk/photo/2126039,,"2019-07-29 09:58:01","2022-10-04 09:26:51"
3,LIN00003,"Hogsthorpe Brickworks (Site Of)","brick works brick kiln clay brick pit",1519401113IMG_2688.jpg,"Former brickworks clay pit now used as fishing lake.",,"John Suter","21st June 2009","John Suter","21st June 2009","Copyright 1",Public,Reviewed,"John Suter","23 February 2018","YAHS Industrial History Section","John Suter","30 July 2020",,,"John Suter","30 July 2020",,,"0000-00-00 00:00:00","2022-12-14 19:02:03"
4,LIN00138,"Harlam Hill Lock","river navigation lock",1524065372Harlam_Hill_Lock.jpg,"Harlam Hill Lock built in 1827 to the design of Sir John Rennie at a cost of Â£2,027 and formerly known as Snitterby Carr Lock\r\n",,Chris,"29 November 2014",Chris,"30 November 2014",Geograph,Public,Reviewed,"Nick Nelson","18 April 2018","YAHS Industrial History Section","Nick Nelson","27 November 2018",,Incomplete,,,http://www.geograph.org.uk/photo/4262271,,"2019-07-29 09:58:01","2022-10-04 16:45:43"
5,LIN00152,"Grimsby Ice Factory","ice manufacture ammonia compressors",1529746519Grimsby_Ice.jpg,"Ice Manufacture",,"J&E Hall Ltd",,"John Suter","23 June 2018","Out of Copyright",Public,Reviewed,"John Suter","23 June 2018","YAHS Industrial History Section","John Suter","30 July 2020",,,,,,,"2019-07-29 09:58:01","2022-10-04 08:12:27"
6,LIN00131,"Chatterton Water Tower","water supply tower",1536565657Chatterton_Tower.jpg,"Chatterton Water Tower, Spalding, in 2007.",,"Richard Croft","23 October 2007","Richard Croft","24 October 2007",Geograph,Public,Reviewed,"Nick Nelson","10 September 2018","YAHS Industrial History Section","Robert Vickers","10 September 2018",,Incomplete,,,http://www.geograph.org.uk/photo/593656,,"2019-07-29 09:58:01","2022-10-04 09:36:18"
7,LIN00181,"St Mary's Conduit","water supply conduit-head",1569254851St_Marys_Conduit.jpg,"The conduit house at St Mary-le-Wigford, Lincoln",,"Jo Turner","25 August 2012","Jo Turner","11 March 2016",Geograph,Public,Reviewed,"Nick Nelson","23 September 2019","YAHS Industrial History Section","Andrew Garford","12 November 2019",,Incomplete,,,https://www.geograph.org.uk/photo/4859156,,"2019-09-23 17:07:32","2022-10-04 15:56:29"
8,LIN00233,"Heckington Windmill","tower windmill corn",1571741416Heckington_Windmill.jpg,"Heckington Windmill in 2014. This is now the only 8-sailed windmill in England.",,"Nick Nelson","3 May 2014","Nick Nelson","3 May 2014","Copyright 1",Public,Reviewed,"Nick Nelson","22 October 2019","YAHS Industrial History Section","Andrew Garford","22 October 2019",,Incomplete,,,,,"2019-10-22 11:50:16","2022-10-04 16:03:42"
9,LIN00113,"RAF Stenigot","chain home radar mast",1586066809Chain_Home_Mast_Stenigot.jpg,"Radar mast at RAF Stenigot. One of the few remaining structures from the 1939 'Chain Home' Radar detection system. This is one of the transmitting masts, the receiving masts were wooden structures.",,"J Hannan-Briggs","11 November 2102","J Hannan Briggs","12 November 2012",Geograph,Public,Reviewed,"Nick Nelson","5 April 2020","YAHS Industrial History Section","Andrew Garford","5 April 2020",,Incomplete,,,https://www.geograph.org.uk/photo/3221459,,"2020-04-05 07:06:50","2022-10-04 09:31:37"
10,LIN00208,"Railway Swing Bridge","swing bridge railway docks",1586706117Boston_Swing_Bridge.jpg,"The Boston docks railway swing bridge across the Haven.",,"Alan Murray-Rust","19 November 2014","Alan Murray-Rust","22 November 2014",Geograph,Public,Reviewed,"Nick Nelson","12 April 2020","YAHS Industrial History Section","Andrew Garford","13 April 2020",,Incomplete,,,https://www.geograph.org.uk/photo/4253980,,"2020-04-12 16:41:59","2022-10-04 16:16:58"
11,LIN00235,"Pinchbeck Pumping Station","beam steam engine pumping land drainage",1587638551Pinchbeck_Beam_Engine_A.jpg,"The parallel motion and cylinder end of the engine beam at Pinchbeck.",,"Peter Ellis","30 May 1971",,,"Web Other",Public,Reviewed,"Nick Nelson","23 April 2020","YAHS Industrial History Section","Andrew Garford","23 April 2020",,Incomplete,,,http://ellisdesign.jalbum.net/Stationary%20Engines%20-%202/Pumping%20Stations/Pinchbeck/index.html,,"2020-04-23 11:42:31","2022-09-25 09:35:25"
12,LIN00235,"Pinchbeck Pumping Station","steam pumping beam engine",1587639201Pinchbeck_Beam_Engine_C.jpg,"The flywheel and crank of the Pinchbeck beam engine. Governor in the middle distance and cylinder beyond.",,"Peter Ellis","30 May 1971",,,"Web Other",Public,Reviewed,"Nick Nelson","23 April 2020","YAHS Industrial History Section","Andrew Garford","23 April 2020",,Incomplete,"John Suter","28 August 2020",http://ellisdesign.jalbum.net/Stationary%20Engines%20-%202/Pumping%20Stations/Pinchbeck/index.html,,"2020-04-23 11:53:21","2022-09-25 09:35:28"
13,LIN00235,"Pinchbeck or Spalding Marsh Pumping Station","pumping station engine house",1587639420Pinchbeck_Engine_House_1833.jpg,"The Pinchbeck engine-house and pumping station of 1833.",,"Ashley Dace","20 May 2013","Ashley Dace","20 May 2013",Geograph,Public,Reviewed,"Nick Nelson","23 April 2020","YAHS Industrial History Section","Andrew Garford","23 April 2020",,Incomplete,,,https://www.geograph.org.uk/photo/3468431,,"2020-04-23 11:57:00","2022-10-04 16:04:25"
14,LIN00235,"Pinchbeck or Spalding Marsh Pumping Station","pumping station",1587639786Pinchbeck_Engine_House_1952.jpg,"The electrically powered pumping station building of 1952 at Pinchbeck. The original steam engine house on the left.",,"Chris Allen","6 October 2007","Chris Allen","9 October 2007",Geograph,Public,Reviewed,"Nick Nelson","23 April 2020","YAHS Industrial History Section","Andrew Garford","23 April 2020",,Incomplete,,,https://www.geograph.org.uk/photo/580048,,"2020-04-23 12:03:06","2022-10-04 16:05:08"
15,LIN00222,"Buttercross Hall","butter cross",1598193537IMG_6424.jpg,"Burwell Butter Cross - Former Butter Cross now used as a village hall",,"John Suter",23/08/2020,"John Suter",23/08/2020,"Copyright 1",Public,Reviewed,"John Suter","23 August 2020","YAHS Industrial History Section","Andrew Garford","22 January 2022",,Incomplete,,,,,"2020-08-23 15:39:03","2022-09-25 09:35:50"
16,LIN00077,"Ketsby Mill","water mill corn OS Map 1888",1639817727Ketsby_Mill_-_NLS.png,"OS map of 1888 showing mill site",,"Ordnance Survey/NLS",1888,"Ordnance Survey/NLS",,NLS,Public,Reviewed,"John Suter","18 December 2021","YAHS Industrial History Section","Nick Nelson","14 January 2022",,Incomplete,,,https://maps.nls.uk,,"2021-12-18 08:55:27","2022-10-04 09:13:01"
17,LIN00199,"Grainthorpe Mill","tower mill windmill corn",1639819570Grainthorpe_Mill_-_NLS.png,"OS Map of 1888 showing site of mill",,"Ordnance Survey/NLS",,"Ordnance Survey/NLS",,NLS,Deleted,Complete,"John Suter","18 December 2021","YAHS Industrial History Section",,,,,,,https://maps.nls.uk,,"2021-12-18 09:26:10","2022-10-03 10:45:05"
18,LIN00008,"Wallace's, Station or Cliffe Mill (Site of)","tower mill windmill flour",1639834535Alford_Station_-_NLS.png,"OS Map of 1888 showing Wallace's or Station Mill to the north-west of the railway station.",,"Ordnance Survey/NLS",1888,"Ordnance Survey/NLS",,NLS,Public,Reviewed,"John Suter","18 December 2021","YAHS Industrial History Section","Nick Nelson","27 January 2022",,Incomplete,,,https://maps.nls.uk/view/101588984,,"2021-12-18 13:35:36","2022-10-04 07:47:00"
19,LIN00008,"Wallace's Mill","tower mill windmill flour",1639834555Alford_Station_-_NLS.png,"OS Map of 1888 showing Wallace's or Station Mill",,"Ordnance Survey/NLS",,"Ordnance Survey/NLS",,NLS,Deleted,Incomplete,"John Suter","18 December 2021","YAHS Industrial History Section",,,,,,,https://maps.nls.uk/view/101588984,,"2021-12-18 13:35:55","2022-10-03 10:45:05"
20,LIN00006,"Alford Railway Station","railway staion great northern",1639834654Alford_Station_-_NLS.png,"OS Map of 1888 showing Alford Station.  Note what appears to be a rail connection between Alford - Sutton Tramway and Great Northern Railway Line at the south-eats end of the station complex",,"Ordnance Survey/NLS",1888,"Ordnance Survey/NLS",,NLS,Public,Incomplete,"John Suter","18 December 2021","YAHS Industrial History Section",,,,,,,https://maps.nls.uk/view/101588984,,"2021-12-18 13:37:34","2022-10-04 07:48:20"
21,LIN00009,"Chamber's Mill (site of)","tower mill windmill corn",1639836243Toothby_Lane_Mill_-_NLS.png,"OS Map of 1888 showing mill",,"Ordnance Survey/NLS",1888,"Ordnance Survey/NLS",,NLS,Public,Incomplete,"John Suter","18 December 2021","YAHS Industrial History Section",,,,,,,http:,,"2021-12-18 14:04:03","2022-10-04 09:08:05"
22,LIN00065,Tramshed,tramshed,1639836521Alford_Station_-_NLS.png,"OS Map of 1888 showing tramshed of Alford and Sutton Tramway",,"Ordnance Survey/NLS",1888,"Ordnance Survey/NLS",,NLS,Public,Incomplete,"John Suter","18 December 2021","YAHS Industrial History Section",,,,,,,http:/,,"2021-12-18 14:08:42","2022-10-04 09:07:47"
23,LIN00123,"Bilsby Windmill","tower mill windmill corn",1639837196Bilsby_Mill_-_NLS.png,"OS Map of 1887 showing Bilsby Mill",,"Ordnance Survey/NLS",1887,"Ordnance Survey/NLS",,NLS,Public,Complete,"John Suter","18 December 2021","YAHS Industrial History Section",,,,,,,https://maps.nls.uk/view/101588993,,"2021-12-18 14:19:58","2022-10-04 09:08:39"
24,LIN00015,"Sutton on Sea Railway Station (Site of)","railway station",1639838589Sutton_on_Sea_Station_-_NLS.png,"OS Map of 1905 showing site of Sutton on Sea Railway Station",,"Ordnance Survey/NLS",1905,"Ordnance Survey/NLS",,NLS,Public,Incomplete,"John Suter","18 December 2021","YAHS Industrial History Section",,,,,,,https://maps.nls.uk/view/101588711,,"2021-12-18 14:43:09","2022-10-04 09:16:06"
25,LIN00017,"Mablethorpe Railway Station (site of)","railway station",1639838958Mablethorpe_Station_-_NLS.png,"OS Map of 1905 showing site of railway station",,"Ordnance Survey/NLS",1905,"Ordnance Survey/NLS",,NLS,Public,Incomplete,"John Suter","18 December 2021","YAHS Industrial History Section",,,,,,,https://maps.nls.uk/view/101588699,,"2021-12-18 14:49:18","2022-10-04 09:13:17"
26,LIN00026,"Sutton on Sea Brickworks and Wind Pump",brickworks,1639839257Mablethorpe_Brickworks_-_NLS.png,"OS Map of 1905 showing site of former brickworks",,"Ordnance Survey/NLS",1905,"Ordnance Survey/NLS",,NLS,Public,Incomplete,"John Suter","18 December 2021","YAHS Industrial History Section",,,,,,,https://maps.nls.uk/view/101588699,,"2021-12-18 14:54:18","2022-10-04 09:16:21"
27,LIN00285,"Mumby Post Mill (Site of)","post mill windmill",1639840660Mumby_Post_Mill_1888.png,"OS Map of 1888 showing post mill.",,"Ordnance Survey/NLS",1888,"Ordnance Survey/NLS",,"Web Other",Public,Reviewed,"John Suter","18 December 2021","YAHS Industrial History Section","Nick Nelson","25 January 2022",,Incomplete,,,https://maps.nls.uk/view/101589014,,"2021-12-18 15:17:40","2022-10-03 12:59:37"
28,LIN00285,"Mumby Post Mill (Site of)","post mill windmill",1639840753Mumby_Post_Mill_1907.png,"OS Map of 1907 showing post mill.  The post mill is still shown on the OS map of 1946 but is not listed in Dolman",,"Ordnance Survey/NLS",1907,"Ordnanace Survey/NLS",,"Web Other",Public,Reviewed,"John Suter","18 December 2021","YAHS Industrial History Section","Nick Nelson","27 January 2022",,Incomplete,,,https://maps.nls.uk/view/101589011,,"2021-12-18 15:19:14","2022-10-03 12:58:44"
29,LIN00097,"Kirton Maltings (site of)",maltings,1639916608Kirton_in_Lindsey_Maltings_-_Google.png,"Kirton in Lindsey Malting prior to demolition.",,"Google Earth",,"Google Earth",,"Google Earth",Public,Reviewed,"John Suter","19 December 2021","YAHS Industrial History Section","Nick Nelson","17 January 2022",,Incomplete,,,https://google,,"2021-12-19 12:23:29","2022-10-04 08:08:03"
30,LIN00097,"Kirton Maltings (site of)",maltings,1639917005Kirton_in_Lindsey_Malting_-_NLS.png,"OS Map of 1905 showing the maltings.  The maltings are not shown on map of 1888, whilst the adjacent Britannia Flour Mill is.",,"Ordnance Survey/NLS",1905,"Ordnance Survey/NLS",,NLS,Public,Reviewed,"John Suter","19 December 2021","YAHS Industrial History Section","Andrew Garford","17 January 2022",,Incomplete,,,https://maps.nls.uk/view/101587937,,"2021-12-19 12:30:05","2022-10-04 09:12:43"
31,LIN00097,"Kirton Maltings (site of)",maltings,1639917359Kirton_in_Lindsey_Malting_-_NLS.png,"OS Map of 1905 showing maltings.  Maltings are not shown on map of 1888, whilst the adjacent Britannia Flour Mill is.",,"Ordnance Survey/NLS",,"Ordnance Survey/NLS",,NLS,Deleted,Incomplete,"John Suter","19 December 2021","YAHS Industrial History Section",,,,,,,https://maps.nls.uk/view/101587937,,"2021-12-19 12:35:59","2022-10-03 10:45:05"
32,LIN00050,"Morton Trent-side Warehouses","riverside warehouses",1639917852Morton_Warehouses_-_NLS.png,"Site of former riverside warehouses shown in 1885",,"Ordnance Survey/NLS",1885,"Ordnance Survey/NLS",,NLS,Public,Reviewed,"John Suter","19 December 2021","YAHS Industrial History Section","Nick Nelson","13 January 2022",,Incomplete,,,https://maps.nls.uk/view/101602173,,"2021-12-19 12:44:14","2022-10-04 09:12:17"
33,LIN00059,"Havenhouse (formerly Croft Bank) Railway Station","railway station",1639918284Haven_House_-_NLS.png,"OS Map of 1888 showing Croft Bank Station now Haven House Station",,"Ordnance Survey/NLS",1888,"Ordnance Survey/NLS",,NLS,Public,Reviewed,"John Suter","19 December 2021","YAHS Industrial History Section","Nick Nelson","13 January 2022",,Incomplete,,,https://maps.nls.uk/view/101589911,,"2021-12-19 12:51:24","2022-10-04 09:15:51"
34,LIN00071,"Skegness Brickworks (site of)",brickworks,1639919553Skegness_1905_-_NLS.png,"OS Map of 1905 showing brickworks, also show on the 1888 1948 and 1951 OS maps By the late 1950's the clay pit was being used as a tip for municipal waste.  Completely filled in the 1960's\r\nhttps://maps.nls.uk/view/101589656",,"Ordnance Survey/NLS",1905,"Ordnance Survey/NLS",,NLS,Public,Reviewed,"John Suter","19 December 2021","YAHS Industrial History Section","Andrew Garford","27 January 2022",,Incomplete,,,https://maps.nls.uk/view/101589656,,"2021-12-19 13:12:33","2022-10-04 09:14:13"
35,LIN00081,"Skirbeck Iron Works (Site Only)","ironworks steam engine portable engines",1639922948Skirbeck_Ironworks_-_NLS.png,"OS Map of 1889 showing site of Skirbeck Ironworks.",,"Ordnance Survey/NLS",1889,"Ordnance Survey/NLS",,NLS,Public,Reviewed,"John Suter","19 December 2021","YAHS Industrial History Section","Nick Nelson","14 January 2022",,Incomplete,,,https://maps.nls.uk/view/101590430,,"2021-12-19 14:09:08","2022-10-04 09:02:42"
36,LIN00001,"Gas Works (Site only)","gas works",1639992432Hogsthorpe_Gas_Woks_-_NLS.png,"OS Map of 1888 showing site of gas works",,"Ordnance Survey/NLS",1888,"Ordnance Survey/NLS",,NLS,Public,Incomplete,"John Suter","20 December 2021","YAHS Industrial History Section",,,,,,,https://maps.nls.uk/view/101589314,,"2021-12-20 09:27:13","2022-10-04 09:15:21"
38,LIN00003,"Hogsthorpe Brickworks (Site Of)",brickworks,1639993038Hogsthorpe_Brickworks_-_NLS.png,"OS Map of 1888 showing site of brickworks",,"Ordnance Survey/NLS",1888,"Ordnance Survey/NLS",,NLS,Public,Incomplete,"John Suter","20 December 2021","YAHS Industrial History Section",,,,,,,https://maps.nls.uk/view/101589314,,"2021-12-20 09:37:18","2022-12-15 08:01:34"
39,LIN00004,"Hogsthorpe High Mill (site only)","tower mill windmill flour",1639993308Hogsthorpe_High_Mill_-_NLS.png,"OS Map of 1888 showing site of High Mill",,"Ordnance Survey/NLS",1888,"Ordnance Survey/NLS",,NLS,Public,Incomplete,"John Suter","20 December 2021","YAHS Industrial History Section",,,,,,,https://maps.nls.uk/view/101589314,,"2021-12-20 09:41:48","2022-10-04 09:14:52"
40,LIN00202,"Ancaster Maltings (Site Of)","maltings and limekilns",1640351394Ancaster_Maltings_-_NLS.png,"Site former maltings",,"Ordnance Survey/NLS",1888,"Ordnance Survey/NLS",,NLS,Public,Incomplete,"John Suter","24 December 2021","YAHS Industrial History Section",,,,,,,https://maps.nls.uk/view/101590280,,"2021-12-24 13:09:54","2022-10-04 09:16:44"
41,LIN00048,"Yarborough Oil Mills (site only)","oil mill",1640355975Yarborough_Oil_Mill_-_NLS.png,"OS Map of 1886 showing Yarborough Oil Mill",,"Ordnance Survey/NLS",1886,"Ordnance Survey/NLS",,NLS,Public,Incomplete,"John Suter","24 December 2021","YAHS Industrial History Section",,,,,,,https://maps.nls.uk/view/101587394,,"2021-12-24 14:26:16","2022-10-04 09:07:08"
42,LIN00284,"Caister Canal Lock","canal, river navigation, canal basin, land drainage",1640612311Caistor_Canal_-_NLS.png,"OS Map of 1888 showing Caistor canal basin at Moortown",,"Ordnance Survey/NLS",1888,"Ordnance Survey/NLS",,NLS,Public,Complete,"John Suter","27 December 2021","YAHS Industrial History Section",,,,,,,https://maps.nls.uk,,"2021-12-27 13:38:32","2022-10-04 09:11:40"
43,LIN00143,"Alford Gas Works (site of)","gas works",1640685314Alford_Gas_Works_-_NLS.png,"OS Map of 1888 showing site of Alford Gas Works",,"Ordnance Survey/NLS",1888,"Ordnance Survey/NLS",,NLS,Public,Incomplete,"John Suter","28 December 2021","YAHS Industrial History Section",,,,,,,https://maps.nls.uk/view/101588993,,"2021-12-28 09:55:14","2022-10-04 09:08:55"
44,LIN00002,"Hogsthorpe Mill","tower mill windmill corn",1640685433Hogsthorpe_Mill_Hill_Windmill_-_NLS.png,"OS Map of 1888 Showing Hogsthorpe Mill Hill Windmill",,"Ordnance Survey/NLS",1888,"Ordnance Survey/NLS",,NLS,Public,Incomplete,"John Suter","28 December 2021","YAHS Industrial History Section",,,,,,,https://maps.nls.uk,,"2021-12-28 09:57:13","2022-10-04 09:14:25"
45,LIN00254,"Tealby Thorpe Watermill","water mill corn",1640867081Tealby_Thorpe_Mill_-_NLS.png,"OS Map of 1887 showing Tealby Mill",,"Ordnance Survey/NLS",,"Ordnance Survey/NLS",,NLS,Deleted,Incomplete,"John Suter","30 December 2021","YAHS Industrial History Section",,,,,,,https://maps.nls.uk/view/101588276,,"2021-12-30 12:24:43","2022-10-03 10:45:05"
46,LIN00254,"Tealby Thorpe Watermill","water mill corn",1640867118Tealby_Thorpe_Mill_-_NLS.png,"OS Map of 1887 showing Tealby Mill",,"Ordnance Survey/NLS",,"Ordnance Survey/NLS",,NLS,Deleted,Incomplete,"John Suter","30 December 2021","YAHS Industrial History Section",,,,,,,https://maps.nls.uk/view/101588276,,"2021-12-30 12:25:18","2022-10-03 10:45:05"
47,LIN00254,"Tealby Thorpe Watermill","water mill corn",1640867163Tealby_Thorpe_Mill_-_NLS.png,"OS Map of 1887 showing Tealby Mill",,"Ordnance Survey/NLS",,"Ordnance Survey/NLS",,NLS,Deleted,Incomplete,"John Suter","30 December 2021","YAHS Industrial History Section",,,,,,,https://maps.nls.uk/view/101588276,,"2021-12-30 12:26:03","2022-10-03 10:45:05"
48,LIN00239,"Tealby Watermill","water mill corn",1640867244Tealby_Mill_-_NLS.png,"OS Map of 1887 showing Tealby Mill\r\nhttps://maps.nls.uk/view/101588276",,"Ordnance Survey/NLS",1887,"Ordnance Survey/NLS",,NLS,Public,Reviewed,"John Suter","30 December 2021","YAHS Industrial History Section","Andrew Garford","22 January 2022",,Incomplete,,,https://maps.nls.uk/view/101588276,,"2021-12-30 12:27:24","2022-10-04 09:13:36"
49,LIN00254,"Tealby Thorpe Watermill","water mill corn",1640867849Tealby_Thorpe_Mill_-_NLS.png,"OS Map of 1887 showing Tealby Thorpe Mill",,"Ordnance Survey/NLS",1887,"Ordnance Survey/NLS",,NLS,Public,Reviewed,"John Suter","30 December 2021","YAHS Industrial History Section","Nick Nelson","27 January 2022",,Incomplete,,,https://maps.nls.uk/view/101588294,,"2021-12-30 12:37:29","2022-10-04 09:11:01"
50,LIN00194,"Skegness Water Tower (Site of)",waterworks,1641633195Skegness_Waterworks_-_NLS.png,"OS Map of 1948 showing site of Skegness Waterworks",,"Ordnance Survey/NLS",1948,"Ordnance Survey/NLS",,NLS,Public,Reviewed,"John Suter","8 January 2022","YAHS Industrial History Section","Andrew Garford","22 January 2022",,Incomplete,,,https://maps.nls.uk/view/101589653,,"2022-01-08 09:13:15","2022-10-04 09:17:26"
51,LIN00215,"Railway Granary (site of)","railway ganary",1641736836Boston_Granary_-_NLS.png,"OS Map of 1947 showing the location of the railway granary just to the south east of Redstone Gowt",,"Ordnance Survey/NLS",1947,"Ordnance Survey/NLS",,NLS,Public,Incomplete,"John Suter","9 January 2022","YAHS Industrial History Section",,,,,,,https://maps.nls.uk/view/101590424,,"2022-01-09 14:00:37","2022-10-04 09:05:56"
52,LIN00213,"Barnetby Maltings (Site of)",maltings,1641740459Barnetby_Maltings_-_NLS.png,"OS Map of 1908 showing Barnetby Maltings",,"Ordnance Survey/NLS",1908,"Ordnance Survey/NLS",,NLS,Public,Incomplete,"John Suter","9 January 2022","YAHS Industrial History Section",,,,,,,https://maps.nls.uk/view/101587400,,"2022-01-09 15:01:01","2022-10-04 09:07:23"
53,LIN00201,"Ancholme Iron Works","Ancholme Victoria ironworks",1641808398Brigg_1905_-_NLS.png,"OS Map of 1905 showing Ancholme and Victoria Ironworks",,"Ordnance Survey/NLS",1905,"Ordnance Survey/NLS",,NLS,Public,Incomplete,"John Suter","10 January 2022","YAHS Industrial History Section",,,,,,,https://maps.nls.uk/view/101587391,,"2022-01-10 09:53:18","2022-10-04 09:06:29"
54,LIN00062,"Mill Hill or Claxby Quarry","chalk quarry",1641824883Claxby_Quarry1.jpg,"View of chalk face in Claxby Quarry, looking towards the approximate location of round barrow / mill mound",,"John Suter","23 August 2020","John Suter","23 August 2020","Copyright 1",Public,Incomplete,"John Suter","10 January 2022","YAHS Industrial History Section",,,,,,,,,"2022-01-10 14:28:08","2022-12-21 16:06:35"
55,LIN00062,"Mill Hill or Claxby Quarry","chalk quarry limekiln draw hole",1641825060Claxby_Quarry2.jpg,"Photo of one of the two badly over grown draw holes at the base of the limekilns",,"John Suter","23 August 2020","John Suter","23 August 2020","Copyright 1",Public,Incomplete,"John Suter","10 January 2022","YAHS Industrial History Section",,,,,,,,,"2022-01-10 14:31:05","2022-12-21 16:06:46"
56,LIN00219,"South Thoresby Chalk Quarry","chalk quarry",1641994665geograph-3087556-by-Chris.jpg,"Aerial photograph of South Thoresby chalk quarry, looking south west",,Chris,"18 August 2012",Chris,"18 August 2012",Geograph,Public,Incomplete,"John Suter","12 January 2022","YAHS Industrial History Section",,,,,,,https://www.geograph.org.uk/reuse.php?id=3087556,,"2022-01-12 13:37:46","2022-12-21 16:07:46"
57,LIN00165,"Ulceby Vale Quarry","chalk quarry",1641994926geograph-5701388-by-Ian-S.jpg,"Ulceby Vale Quarry looking west",,"Ian S","7 March 2018","Ian S","8 April 2018",Geograph,Public,Incomplete,"John Suter","12 January 2022","YAHS Industrial History Section",,,,,,,https://www.geograph.org.uk/more.php?id=5701388,,"2022-01-12 13:42:06","2022-12-21 16:07:52"
58,LIN00091,"Cleethorpes Air Raid Shelter","ww1 air raid shelter",1641995087geograph-915468-by-Richard-Croft.jpg,"Yarra Road WWI Air Raid Shelter of 1916\r\nBuilt by a local resident Joseph Forrester, following a Zeppelin raid on the 31st March 1916, this is possibly the first civilian air raid shelter in Britain.",,"Richard Croft","3 April 2008","Richard Croft","9 August 2008",Geograph,Public,Reviewed,"John Suter","12 January 2022","YAHS Industrial History Section","Nick Nelson","17 January 2022",,Incomplete,,,https://www.geograph.org.uk/reuse.php?id=915468,,"2022-01-12 13:44:47","2022-12-21 16:07:58"